﻿通し,厚労省NO,無症状病原体保有者,国内,チャーター便,年代,性別,確定日,発症日,受診都道府県,居住都道府県,居住管内,居住市区町村,キー,発表,都道府県内症例番号,市町村内症例番号,ステータス,備考,ソース,ソース2,ソース3,人数,累計,前日比,発症数,死者合計,退院数累計,退院数,PCR検査実施人数,PCR検査前日比,職業_正誤確認用,勤務先_正誤確認用,Hospital Pref,Residential Pref,Release,Gender,X,Y,確定日YYYYMMDD,受診都道府県コード,居住都道府県コード,更新日時,Field2,Field4,Field5,Field6,Field7,Field8,Field9,Field10,,,
1 ,1 ,,A-1,,30 ,男性,1/15/2020,1/3/2020,神奈川県,神奈川県,,,神奈川県,神奈川県,1,,退院,,https://www.mhlw.go.jp/stf/newpage_08906.html,https://www.pref.kanagawa.jp/docs/ga4/bukanshi/occurrence.html,,1 ,1 ,1 ,0 ,,1 ,1 ,,,,,Kanagawa,Kanagawa,Kanagawa Prefecture,Male,139.642347,35.447504,2020/1/15,14,14,12/25/2020 12:04,,,,,,,,,,,
2 ,2 ,,A-2,,40 ,男性,1/24/2020,1/14/2020,東京都,中華人民共和国,,,中華人民共和国,東京都,1,,退院または死亡,,https://www.mhlw.go.jp/stf/newpage_09079.html,https://www.metro.tokyo.lg.jp/tosei/hodohappyo/press/2020/01/24/20.html,,1 ,2 ,1 ,2 ,,,,,,,,Tokyo,China(Mainland),Tokyo Metropolitan Government,Male,116.409685,39.903832,2020/1/24,13,NA,,,,,,,,,,,,
3 ,3 ,,A-3,,30 ,女性,1/25/2020,1/21/2020,東京都,中華人民共和国,,,中華人民共和国,東京都,2,,退院または死亡,,https://www.mhlw.go.jp/stf/newpage_09099.html,https://www.metro.tokyo.lg.jp/tosei/hodohappyo/press/2020/01/27/24.html,,1 ,3 ,1 ,2 ,,,,,,,,Tokyo,China(Mainland),Tokyo Metropolitan Government,Female,116.409685,39.903832,2020/1/25,13,NA,,,,,,,,,,,,
4 ,4 ,,A-4,,40 ,男性,1/26/2020,1/23/2020,愛知県,中華人民共和国,,,中華人民共和国,愛知県,1,,,国籍:中国,https://www.mhlw.go.jp/stf/newpage_09100.html,https://www.pref.aichi.jp/uploaded/attachment/321138.pdf,,1 ,4 ,1 ,3 ,,,,,,,,Aichi,China(Mainland),Aichi Prefecture,Male,116.409685,39.903832,2020/1/26,23,NA,,,,,,,,,,,,
5 ,5 ,,A-5,,40 ,男性,1/28/2020,1/22/2020,愛知県,中華人民共和国,,,中華人民共和国,愛知県,2,,,国籍:中国,https://www.mhlw.go.jp/stf/newpage_09154.html,https://www.pref.aichi.jp/uploaded/attachment/321141.pdf,,1 ,,,,,,,,,,,Aichi,China(Mainland),Aichi Prefecture,Male,116.409685,39.903832,2020/1/28,23,NA,,,,,,,,,,,,
6 ,6 ,,A-6,,60 ,男性,1/28/2020,1/14/2020,奈良県,奈良県,,,奈良県,厚生労働省,,,,,https://www.mhlw.go.jp/stf/newpage_09153.html,http://www.pref.nara.jp/secure/222663/20200128koronanahoudokorosyo.pdf,,1 ,,,,,,,,,,,Nara,Nara,MHLW,Male,135.832745,34.685295,2020/1/28,29,29,,,,,,,,,,,,
7 ,7 ,,A-7,,40 ,女性,1/28/2020,1/26/2020,北海道,中華人民共和国,,,中華人民共和国,北海道,1,,,,https://www.mhlw.go.jp/stf/newpage_09158.html,http://www.pref.hokkaido.lg.jp/hf/kth/kak/hasseijoukyou.htm#1/28,,1 ,7 ,3 ,1 ,,,,,,,,Hokkaido,China(Mainland),Hokkaido Prefecture,Female,116.409685,39.903832,2020/1/28,01,NA,,,,,,,,,,,,
8 ,8 ,,A-8,,40 ,女性,1/29/2020,1/20/2020,大阪府,大阪府,,,大阪府,大阪府,,,,,https://www.mhlw.go.jp/stf/newpage_09201.html,http://www.pref.osaka.lg.jp/hodo/index.php?site=fumin&pageId=37147,,1 ,8 ,1 ,2 ,,,,,,バスガイド,,Osaka,Osaka,Osaka Prefecture,Female,135.51992,34.685972,2020/1/29,27,27,,,,,,,,,,,,
9 ,9 ,,,B-1,50 ,男性,1/30/2020,1/29/2020,不明,中華人民共和国,,,中華人民共和国,厚生労働省,,,退院,,https://www.mhlw.go.jp/stf/newpage_09205.html,,,1 ,,,,,,,,,,,Unknown,China(Mainland),MHLW,Male,116.409685,39.903832,2020/1/30,NA,NA,,,,,,,,,,,,
10 ,-,チャーター無症状2,,,50 ,女性,1/30/2020,,千葉県,中華人民共和国,,,中華人民共和国,千葉県,千葉県無症状1,,退院,,https://www.mhlw.go.jp/stf/newpage_09205.html,https://www.pref.chiba.lg.jp/shippei/press/2019/ncov20200131.html,https://www.pref.chiba.lg.jp/kenfuku/kansenshou/ncov/documents/200228kikikanrihonbu6.pdf,1 ,,,,,,,,,,,Chiba,China(Mainland),Chiba Prefecture,Female,116.409685,39.903832,2020/1/30,12,NA,,,,,,,,,,,,
11 ,10 ,,A-9,,50 ,男性,1/30/2020,1/25/2020,三重県,三重県,,,三重県,厚生労働省,1,,退院,,https://www.mhlw.go.jp/stf/newpage_09236.html,https://www.pref.mie.lg.jp/YAKUMUS/HP/m0068000071_00004.htm,,1 ,,,,,,,,,,,Mie,Mie,MHLW,Male,136.50861,34.730546,2020/1/30,24,24,,,,,,,,,,,,
12 ,11 ,,A-10,,30 ,女性,1/30/2020,1/24/2020,東京都,中華人民共和国,,,中華人民共和国,東京都,3,,退院または死亡,,https://www.mhlw.go.jp/stf/newpage_09237.html,https://www.bousai.metro.tokyo.lg.jp/taisaku/saigai/1007261/1007264.html,,1 ,,,,,,,,,,,Tokyo,China(Mainland),Tokyo Metropolitan Government,Female,116.409685,39.903832,2020/1/30,13,NA,,,,,,,,,,,,
13 ,12 ,,A-11,,20 ,女性,1/30/2020,1/28/2020,京都府,京都府,,京都市,京都府京都市,京都市,1,1,退院,,https://www.mhlw.go.jp/stf/newpage_09239.html,https://www.pref.kyoto.jp/kentai/news/novelcoronavirus.html#F,https://www.city.kyoto.lg.jp/hokenfukushi/cmsfiles/contents/0000266/266641/200404nyutaiin.pdf,1 ,,,,,,,,,,,Kyoto,Kyoto,Kyoto City,Female,135.751464,35.010117,2020/1/30,26,26,,,,,,,,,,,,
14 ,16 ,,,B-4,40 ,男性,1/30/2020,2/1/2020,千葉県,中華人民共和国,,,中華人民共和国,千葉県,2,,,チャーター無症状1から発症,https://www.cas.go.jp/jp/influenza/sidai_r020214.pdf,https://www.pref.chiba.lg.jp/shippei/press/2019/ncov20200130.html,https://www.pref.chiba.lg.jp/kenfuku/kansenshou/ncov/documents/200228kikikanrihonbu6.pdf,1 ,14 ,6 ,1 ,,,,,,,,Chiba,China(Mainland),Chiba Prefecture,Male,116.409685,39.903832,2020/1/30,12,NA,,,,,,,,,,,,
15 ,13 ,,A-12,,20 ,女性,1/31/2020,1/20/2020,千葉県,千葉県,,千葉市,千葉県千葉市,千葉県,1,1,退院,,https://www.mhlw.go.jp/stf/newpage_09271.html,https://www.pref.chiba.lg.jp/shippei/press/2019/ncov20200131.html,https://www.pref.chiba.lg.jp/kenfuku/kansenshou/ncov/documents/200228kikikanrihonbu6.pdf,1 ,,,,,,,,,バスガイド,,Chiba,Chiba,Chiba Prefecture,Female,140.123095,35.607434,2020/1/31,12,12,,,,,,,,,,,,
16 ,-,チャーター無症状3,,,30 ,男性,1/31/2020,,不明,不明,,,不明,厚生労働省,,,,,https://www.mhlw.go.jp/stf/newpage_09273.html,,,1 ,16 ,2 ,4 ,,,,,,,,Unknown,Unknown,MHLW,Male,0,0,2020/1/31,NA,NA,,,,,,,,,,,,
17 ,14 ,,,B-2,40 ,男性,2/1/2020,1/31/2020,不明,不明,,,不明,厚生労働省,,,,,https://www.mhlw.go.jp/stf/newpage_09278.html,,,1 ,,,,,,,,,,,Unknown,Unknown,MHLW,Male,0,0,2020/2/1,NA,NA,,,,,,,,,,,,
18 ,15 ,,,B-3,40 ,男性,2/1/2020,1/26/2020,埼玉県,中華人民共和国,,,中華人民共和国,埼玉県,1,,退院,,https://www.mhlw.go.jp/stf/newpage_09278.html,https://www.pref.saitama.lg.jp/a0701/documents/yose22817.pdf,,1 ,,,,,,,,,,,Saitama,China(Mainland),Saitama Prefecture,Male,116.409685,39.903832,2020/2/1,11,NA,,,,,,,,,,,,
19 ,-,チャーター無症状5,,,30 ,男性,2/1/2020,,不明,不明,,,不明,厚生労働省,,,,,https://www.mhlw.go.jp/stf/newpage_09278.html,,,1 ,19 ,3 ,3 ,,,,,,,,Unknown,Unknown,MHLW,Male,0,0,2020/2/1,NA,NA,,,,,,,,,,,,
20 ,17 ,,A-13,,30 ,女性,2/4/2020,1/30/2020,千葉県,中華人民共和国,,,中華人民共和国,千葉県,3,,退院,,https://www.mhlw.go.jp/stf/newpage_09310.html,https://www.pref.chiba.lg.jp/shippei/press/2019/ncov20200204.html,https://www.pref.chiba.lg.jp/kenfuku/kansenshou/ncov/documents/200228kikikanrihonbu6.pdf,1 ,,,,,,,,,,,Chiba,China(Mainland),Chiba Prefecture,Female,116.409685,39.903832,2020/2/4,12,NA,,,,,,,,,,,,
21 ,18 ,,,B-5,50 ,女性,2/4/2020,1/31/2020,不明,中華人民共和国,,,中華人民共和国,厚生労働省,,,,,https://www.mhlw.go.jp/stf/newpage_09311.html,,,1 ,,,,,,,,,,,Unknown,China(Mainland),MHLW,Female,116.409685,39.903832,2020/2/4,NA,NA,,,,,,,,,,,,
22 ,19 ,,A-14,,50 ,男性,2/4/2020,1/26/2020,不明,中華人民共和国,,,中華人民共和国,厚生労働省,,,,,https://www.mhlw.go.jp/stf/newpage_09312.html,,,1 ,,,,,,,,,,,Unknown,China(Mainland),MHLW,Male,116.409685,39.903832,2020/2/4,NA,NA,,,,,,,,,,,,
23 ,21 ,,A-16,,20 ,男性,2/4/2020,1/25/2020,京都府,京都府,,京都市,京都府京都市,京都市,2,2,退院,,https://www.mhlw.go.jp/stf/newpage_09336.html,https://www.city.kyoto.lg.jp/hokenfukushi/page/0000264489.html,https://www.city.kyoto.lg.jp/hokenfukushi/cmsfiles/contents/0000264/264489/020205-01.pdf,1 ,23 ,4 ,5 ,,,,,,,,Kyoto,Kyoto,Kyoto City,Male,135.751464,35.010117,2020/2/4,26,26,,,,,,,,,,,,
24 ,20 ,,A-15,,40 ,男性,2/5/2020,1/24/2020,千葉県,中華人民共和国,,,中華人民共和国,千葉県,4,,退院,,https://www.mhlw.go.jp/stf/newpage_09333.html,https://www.pref.chiba.lg.jp/shippei/press/2019/ncov20200205.html,https://www.pref.chiba.lg.jp/kenfuku/kansenshou/ncov/documents/200228kikikanrihonbu6.pdf,1 ,,,,,,,,,,,Chiba,China(Mainland),Chiba Prefecture,Male,116.409685,39.903832,2020/2/5,12,NA,,,,,,,,,,,,
25 ,22 ,,,B-6,50 ,男性,2/5/2020,,不明,中華人民共和国,,,中華人民共和国,厚生労働省,,,,チャーター無症状4から発症,https://www.mhlw.go.jp/stf/newpage_09450.html,,,1 ,25 ,2 ,2 ,,,,,,,,Unknown,China(Mainland),MHLW,Male,116.409685,39.903832,2020/2/5,NA,NA,,,,,,,,,,,,
26 ,23 ,,,B-7,20 ,男性,2/7/2020,2/7/2020,不明,中華人民共和国,,,中華人民共和国,厚生労働省,,,,,https://www.mhlw.go.jp/stf/newpage_09399.html,,,1 ,26 ,1 ,5 ,,4 ,3 ,,,,,Unknown,China(Mainland),MHLW,Male,116.409685,39.903832,2020/2/7,NA,NA,,,,,,,,,,,,
27 ,24 ,,,B-8,40 ,男性,2/10/2020,2/8/2020,埼玉県,埼玉県,,,埼玉県,埼玉県,2,,退院,,https://www.mhlw.go.jp/stf/newpage_09422.html,https://www.pref.saitama.lg.jp/a0701/documents/yose22817.pdf,,1 ,,,,,,,,,,,Saitama,Saitama,Saitama Prefecture,Male,139.647804,35.857771,2020/2/10,11,11,,,,,,,,,,,,
28 ,25 ,,,B-9,50 ,男性,2/10/2020,2/7/2020,千葉県,中華人民共和国,,,中華人民共和国,千葉県,5,,退院,,https://www.mhlw.go.jp/stf/newpage_09423.html,https://www.pref.chiba.lg.jp/shippei/press/2019/ncov20200211.html,https://www.pref.chiba.lg.jp/kenfuku/kansenshou/ncov/documents/200228kikikanrihonbu6.pdf,1 ,28 ,2 ,9 ,,9 ,5 ,,,,,Chiba,China(Mainland),Chiba Prefecture,Male,116.409685,39.903832,2020/2/10,12,NA,,,,,,,,,,,,
29 ,26 ,,A-17,,50 ,男性,2/11/2020,,神奈川県,神奈川県,,,神奈川県,神奈川県,2,,,検疫官,https://www.mhlw.go.jp/stf/newpage_09424.html,https://www.pref.kanagawa.jp/docs/ga4/bukanshi/occurrence.html,,1 ,29 ,1 ,0 ,,10 ,1 ,,,,,Kanagawa,Kanagawa,Kanagawa Prefecture,Male,139.642347,35.447504,2020/2/11,14,14,,,,,,,,,,,,
30 ,27 ,,A-18,,80 ,女性,2/13/2020,1/22/2020,神奈川県,神奈川県,,,神奈川県,神奈川県,3,,死亡1例目,,https://www.mhlw.go.jp/stf/newpage_09503.html,https://www.pref.kanagawa.jp/docs/ga4/bukanshi/occurrence.html,,1 ,,,,,,,,,,,Kanagawa,Kanagawa,Kanagawa Prefecture,Female,139.642347,35.447504,2020/2/13,14,14,,,,,,,,,,,,
31 ,28 ,,A-19,,70 ,男性,2/13/2020,1/29/2020,東京都,東京都,,,東京都,東京都,4,,,,https://www.mhlw.go.jp/stf/newpage_09504.html,https://www.bousai.metro.tokyo.lg.jp/taisaku/saigai/1007261/1007323.html,https://mainichi.jp/articles/20200214/k00/00m/040/375000c,1 ,,,,,,,,,タクシー運転手,,Tokyo,Tokyo,Tokyo Metropolitan Government,Male,139.691647,35.689185,2020/2/13,13,13,,,,,,,,,,,,
32 ,29 ,,A-20,,50 ,男性,2/13/2020,1/31/2020,和歌山県,和歌山県,,和歌山市,和歌山県和歌山市,和歌山県,,,退院,,https://www.mhlw.go.jp/stf/newpage_09505.html,https://www.pref.wakayama.lg.jp/prefg/041200/d00203387.html,,1 ,,,,,,,,,医師,,Wakayama,Wakayama,Wakayama Prefecture,Male,135.17073,34.230338,2020/2/13,30,30,,,,,,,,,,,,
33 ,30 ,,A-21,,20 ,男性,2/13/2020,2/2/2020,千葉県,千葉県,,市川市,千葉県市川市,千葉県,6,1,,,https://www.mhlw.go.jp/stf/newpage_09506.html,https://www.pref.chiba.lg.jp/shippei/press/2019/ncov20200213.html,https://www.pref.chiba.lg.jp/kenfuku/kansenshou/ncov/documents/200228kikikanrihonbu6.pdf,1 ,33 ,4 ,7 ,1 ,11 ,1 ,,,,,Chiba,Chiba,Chiba Prefecture,Male,139.927874,35.713415,2020/2/13,12,12,,,,,,,,,,,,
34 ,31 ,,A-22,,70 ,男性,2/14/2020,2/1/2020,和歌山県,和歌山県,,,和歌山県,厚生労働省,,,死亡5例目,,https://www.mhlw.go.jp/stf/newpage_09539.html,https://www.pref.wakayama.lg.jp/prefg/041200/d00203387_d/fil/20200214press.pdf,https://www.mhlw.go.jp/stf/newpage_09841.html,1 ,,,,,,,,,農業,,Wakayama,Wakayama,MHLW,Male,135.167511,34.225965,2020/2/14,30,30,,,,,,,,,,,,
35 ,32 ,,A-23,,60 ,女性,2/14/2020,2/5/2020,沖縄県,沖縄県,,,沖縄県,沖縄県,1,,退院,南部保健所管内,https://www.mhlw.go.jp/stf/newpage_09539.html,https://www.pref.okinawa.jp/site/hoken/chiikihoken/kekkaku/press/documents/20200214_covid19_1.pdf,,1 ,,,,,,,,,タクシー運転手,,Okinawa,Okinawa,Okinawa Prefecture,Female,127.681114,26.211537,2020/2/14,47,47,,,,,,,,,,,,
36 ,33 ,,A-24,,50 ,女性,2/14/2020,2/4/2020,東京都,東京都,,,東京都,東京都,5,,退院または死亡,,https://www.mhlw.go.jp/stf/newpage_09539.html,https://www.bousai.metro.tokyo.lg.jp/taisaku/saigai/1007261/1007327.html,,1 ,,,,,,,,,,,Tokyo,Tokyo,Tokyo Metropolitan Government,Female,139.691647,35.689185,2020/2/14,13,13,,,,,,,,,,,,
37 ,34 ,,A-25,,70 ,男性,2/14/2020,1/20/2020,東京都,東京都,,,東京都,東京都,6,,退院または死亡,,https://www.mhlw.go.jp/stf/newpage_09539.html,https://www.bousai.metro.tokyo.lg.jp/taisaku/saigai/1007261/1007328.html,https://mainichi.jp/articles/20200214/k00/00m/040/375000c,1 ,,,,,,,,,屋形船アルバイト,,Tokyo,Tokyo,Tokyo Metropolitan Government,Male,139.691647,35.689185,2020/2/14,13,13,,,,,,,,,,,,
38 ,35 ,,A-26,,60 ,男性,2/14/2020,2/3/2020,愛知県,愛知県,,名古屋市,愛知県名古屋市,名古屋市,3,1,,,https://www.mhlw.go.jp/stf/newpage_09539.html,http://www.city.nagoya.jp/kenkofukushi/cmsfiles/contents/0000124/124556/R20214kisyahappyou.pdf,,1 ,,,,,,,,,,,Aichi,Aichi,Nagoya City,Male,136.910184,35.1686,2020/2/14,23,23,,,,,,,,,,,,
39 ,36 ,,A-27,,50 ,男性,2/14/2020,1/31/2020,北海道,北海道,石狩振興局,札幌市,北海道札幌市,札幌市,2,,,,https://www.mhlw.go.jp/stf/newpage_09539.html,http://www.pref.hokkaido.lg.jp/hf/kth/kak/hasseijoukyou.htm#2/14,https://www.city.sapporo.jp/hokenjo/f1kansen/2019n-covhassei.html#h0214,1 ,,,,,,,,,自営業,,Hokkaido,Hokkaido,Sapporo City,Male,141.341078,43.055282,2020/2/14,01,01,,,,,,,,,,,,
40 ,37 ,,A-28,,30 ,男性,2/14/2020,2/10/2020,神奈川県,神奈川県,,,神奈川県,神奈川県,4,,,,https://www.mhlw.go.jp/stf/newpage_09541.html,https://www.pref.kanagawa.jp/docs/ga4/bukanshi/occurrence.html,,1 ,,,,,,,,,自治体職員,,Kanagawa,Kanagawa,Kanagawa Prefecture,Male,139.642347,35.447504,2020/2/14,14,14,,,,,,,,,,,,
41 ,-,チャーター無症状6,,,60 ,女性,2/14/2020,,埼玉県,不明,,,不明,厚生労働省,3,,退院,,https://www.mhlw.go.jp/stf/newpage_09537.html,https://www.kantei.go.jp/jp/singi/novel_coronavirus/th_siryou/sidai_r020216.pdf,,1 ,41 ,8 ,9 ,1 ,12 ,1 ,,,,,Saitama,Unknown,MHLW,Female,0,0,2020/2/14,11,NA,,,,,,,,,,,,
42 ,38 ,,A-29,,50 ,男性,2/15/2020,2/4/2020,和歌山県,和歌山県,,,和歌山県,厚生労働省,,,退院,厚労省NO29の勤務先医療機関の同僚,https://www.mhlw.go.jp/stf/newpage_09543.html,https://www.pref.wakayama.lg.jp/prefg/041200/d00203387_d/fil/20200215press.pdf,,1 ,,,,,,,,,医師,,Wakayama,Wakayama,MHLW,Male,135.167511,34.225965,2020/2/15,30,30,,,,,,,,,,,,
43 ,39 ,,A-30,,50 ,女性,2/15/2020,2/7/2020,和歌山県,和歌山県,,,和歌山県,厚生労働省,,,退院,厚労省NO38の妻,https://www.mhlw.go.jp/stf/newpage_09543.html,https://www.pref.wakayama.lg.jp/prefg/041200/d00203387_d/fil/20200215press.pdf,,1 ,,,,,,,,,,,Wakayama,Wakayama,MHLW,Female,135.167511,34.225965,2020/2/15,30,30,,,,,,,,,,,,
44 ,40 ,,A-31,,60 ,男性,2/15/2020,2/2/2020,和歌山県,和歌山県,,,和歌山県,厚生労働省,,,退院,厚労省NO29の勤務先医療機関の患者,https://www.mhlw.go.jp/stf/newpage_09543.html,https://www.pref.wakayama.lg.jp/prefg/041200/d00203387_d/fil/20200215press.pdf,,1 ,,,,,,,,,会社員,,Wakayama,Wakayama,MHLW,Male,135.167511,34.225965,2020/2/15,30,30,,,,,,,,,,,,
45 ,-,国内無症状,,,80 ,男性,2/15/2020,,東京都,東京都,,,東京都,東京都,7,,退院または死亡,東京都新型コロナウイルス感染上対策本部発第16報のうち、症状のない者「１」,https://www.mhlw.go.jp/stf/newpage_09544.html,https://www.bousai.metro.tokyo.lg.jp/taisaku/saigai/1007261/1007329.html,,1 ,,,,,,,,,タクシー運転手,,Tokyo,Tokyo,Tokyo Metropolitan Government,Male,139.691647,35.689185,2020/2/15,13,13,,,,,,,,,,,,
46 ,-,国内無症状,,,50 ,女性,2/15/2020,,東京都,東京都,,,東京都,東京都,8,,退院または死亡,東京都新型コロナウイルス感染上対策本部発第16報のうち、症状のない者「２」,https://www.mhlw.go.jp/stf/newpage_09544.html,https://www.bousai.metro.tokyo.lg.jp/taisaku/saigai/1007261/1007329.html,,1 ,,,,,,,,,タクシー運転手,,Tokyo,Tokyo,Tokyo Metropolitan Government,Female,139.691647,35.689185,2020/2/15,13,13,,,,,,,,,,,,
47 ,43 ,,A-34,,60 ,女性,2/15/2020,2/13/2020,愛知県,愛知県,,名古屋市,愛知県名古屋市,名古屋市,4,2,,,https://www.mhlw.go.jp/stf/newpage_09545.html,http://www.city.nagoya.jp/kenkofukushi/cmsfiles/contents/0000124/124556/R20215kisyahappyou.pdf,,1 ,,,,,,,,,,,Aichi,Aichi,Nagoya City,Female,136.910184,35.1686,2020/2/15,23,23,,,,,,,,,,,,
48 ,-,国内無症状,,,50 ,男性,2/15/2020,,東京都,東京都,,,東京都,東京都,9,,退院または死亡,東京都新型コロナウイルス感染上対策本部発第16報のうち、症状のない者「３」,https://www.mhlw.go.jp/stf/newpage_09544.html,https://www.bousai.metro.tokyo.lg.jp/taisaku/saigai/1007261/1007329.html,,1 ,,,,,,,,,タクシー運転手,,Tokyo,Tokyo,Tokyo Metropolitan Government,Male,139.691647,35.689185,2020/2/15,13,13,,,,,,,,,,,,
49 ,-,国内無症状,,,70 ,男性,2/15/2020,,東京都,東京都,,,東京都,東京都,10,,退院または死亡,東京都新型コロナウイルス感染上対策本部発第16報のうち、症状のない者「４」,https://www.mhlw.go.jp/stf/newpage_09544.html,https://www.bousai.metro.tokyo.lg.jp/taisaku/saigai/1007261/1007329.html,,1 ,,,,,,,,,タクシー運転手,,Tokyo,Tokyo,Tokyo Metropolitan Government,Male,139.691647,35.689185,2020/2/15,13,13,,,,,,,,,,,,
50 ,-,国内無症状,,,70 ,男性,2/15/2020,,東京都,東京都,,,東京都,東京都,11,,退院または死亡,東京都新型コロナウイルス感染上対策本部発第16報のうち、症状のない者「５」,https://www.mhlw.go.jp/stf/newpage_09544.html,https://www.bousai.metro.tokyo.lg.jp/taisaku/saigai/1007261/1007329.html,,1 ,,,,,,,,,タクシー運転手,,Tokyo,Tokyo,Tokyo Metropolitan Government,Male,139.691647,35.689185,2020/2/15,13,13,,,,,,,,,,,,
51 ,42 ,,A-32,,40 ,男性,2/15/2020,2/2/2020,東京都,東京都,,,東京都,東京都,12,,退院または死亡,,https://www.mhlw.go.jp/stf/newpage_09544.html,https://www.bousai.metro.tokyo.lg.jp/taisaku/saigai/1007261/1007331.html,,1 ,,,,,,,,,,,Tokyo,Tokyo,Tokyo Metropolitan Government,Male,139.691647,35.689185,2020/2/15,13,13,,,,,,,,,,,,
52 ,41 ,,A-33,,60 ,女性,2/15/2020,,東京都,東京都,,,東京都,東京都,13,,退院または死亡,東京都新型コロナウイルス感染上対策本部発第16報のうち、症状のあった者「７」,https://www.mhlw.go.jp/stf/newpage_09544.html,https://www.bousai.metro.tokyo.lg.jp/taisaku/saigai/1007261/1007329.html,,1 ,,,,,,,,,,,Tokyo,Tokyo,Tokyo Metropolitan Government,Female,139.691647,35.689185,2020/2/15,13,13,,,,,,,,,,,,
53 ,-,国内無症状,,,40 ,男性,2/15/2020,,東京都,東京都,,,東京都,東京都,14,,退院または死亡,東京都新型コロナウイルス感染上対策本部発第16報のうち、症状のない者「６」,https://www.mhlw.go.jp/stf/newpage_09544.html,https://www.bousai.metro.tokyo.lg.jp/taisaku/saigai/1007261/1007329.html,,1 ,53 ,12 ,9 ,,,,,,タクシー運転手,,Tokyo,Tokyo,Tokyo Metropolitan Government,Male,139.691647,35.689185,2020/2/15,13,13,,,,,,,,,,,,
54 ,44 ,,A-35,,60 ,男性,2/16/2020,2/15/2020,愛知県,愛知県,,,愛知県,愛知県,5,,,尾張地方,https://www.mhlw.go.jp/stf/newpage_09548.html,https://www.pref.aichi.jp/uploaded/attachment/321683.pdf,,1 ,,,,,,,,,,,Aichi,Aichi,Aichi Prefecture,Male,136.906698,35.180246,2020/2/16,23,23,,,,,,,,,,,,
55 ,46 ,,A-37,,60 ,男性,2/16/2020,,東京都,東京都,,,東京都,東京都,15,,,東京都新型コロナウイルス感染上対策本部発第18報のうち、症状のあった者「８」,https://www.mhlw.go.jp/stf/newpage_09548.html,https://www.bousai.metro.tokyo.lg.jp/taisaku/saigai/1007261/1007332.html,,1 ,,,,,,,,,,,Tokyo,Tokyo,Tokyo Metropolitan Government,Male,139.691647,35.689185,2020/2/16,13,13,,,,,,,,,,,,
56 ,45 ,,A-36,,30 ,男性,2/16/2020,2/3/2020,東京都,東京都,,,東京都,東京都,16,,退院または死亡,,https://www.mhlw.go.jp/stf/newpage_09548.html,https://www.bousai.metro.tokyo.lg.jp/taisaku/saigai/1007261/1007334.html,,1 ,,,,,,,,,,,Tokyo,Tokyo,Tokyo Metropolitan Government,Male,139.691647,35.689185,2020/2/16,13,13,,,,,,,,,,,,
57 ,47 ,,A-38,,60 ,男性,2/16/2020,2/6/2020,東京都,埼玉県,,,埼玉県,東京都,17,,退院または死亡,,https://www.mhlw.go.jp/stf/newpage_09548.html,https://www.bousai.metro.tokyo.lg.jp/taisaku/saigai/1007261/1007333.html,https://www.asahi.com/articles/ASN2J6FVGN2JUTIL01C.html,1 ,,,,,,,,,ハイヤー運転手,,Tokyo,Saitama,Tokyo Metropolitan Government,Male,139.647804,35.857771,2020/2/16,13,11,,,,,,,,,,,,
58 ,,国内無症状,,,60 ,男性,2/16/2020,,東京都,東京都,,,東京都,東京都,18,,退院または死亡,「（第18報）都内患者（2月13日判明）の積極的疫学調査の実施状況（第3報）」から「陽性者に係る濃厚接触者の検査結果（速報）」,,https://www.bousai.metro.tokyo.lg.jp/taisaku/saigai/1007261/1007332.html,,1 ,,,,,,,,,,,Tokyo,Tokyo,Tokyo Metropolitan Government,Male,139.691647,35.689185,2020/2/16,13,13,,,,,,,,,,,,
59 ,-,国内無症状,,,30 ,男性,2/16/2020,,東京都,東京都,,,東京都,東京都,19,,退院または死亡,東京都新型コロナウイルス感染上対策本部発第18報のうち、症状のない者「９」,,https://www.bousai.metro.tokyo.lg.jp/taisaku/saigai/1007261/1007332.html,,1 ,59 ,6 ,15 ,,,,,,タクシー運転手の同居者,,Tokyo,Tokyo,Tokyo Metropolitan Government,Male,139.691647,35.689185,2020/2/16,13,13,,,,,,,,,,,,
60 ,48 ,,A-39,,40 ,女性,2/17/2020,2/14/2020,神奈川県,神奈川県,,相模原市,神奈川県相模原市,相模原市,5,,,,https://www.mhlw.go.jp/stf/newpage_09576.html,https://www.pref.kanagawa.jp/docs/ga4/bukanshi/occurrence.html,https://www.city.sagamihara.kanagawa.jp/_res/projects/default_project/_page_/001/019/191/0217_02.pdf,1 ,,,,,,,,,,,Kanagawa,Kanagawa,Sagamihara City,Female,139.373234,35.571374,2020/2/17,14,14,,,,,,,,,,,,
61 ,-,国内無症状,,,50 ,女性,2/17/2020,,和歌山県,和歌山県,,,和歌山県,和歌山県,,,退院,厚労省NO40の妻,,https://www.pref.wakayama.lg.jp/prefg/041200/d00203387_d/fil/20200217teisei.pdf,,1 ,,,,,,,,,,,Wakayama,Wakayama,Wakayama Prefecture,Female,135.167511,34.225965,2020/2/17,30,30,,,,,,,,,,,,
62 ,49 ,,A-40,,50 ,男性,2/17/2020,,不明,不明,,,不明,厚生労働省,,,,厚労省職員,https://www.mhlw.go.jp/stf/newpage_09558.html,,,1 ,,,,,,,,,,,Unknown,Unknown,MHLW,Male,0,0,2020/2/17,NA,NA,,,,,,,,,,,,
63 ,50 ,,A-41,,80 ,女性,2/17/2020,,和歌山県,和歌山県,,,和歌山県,和歌山県,,,退院,厚労省NO40の母,https://www.mhlw.go.jp/stf/newpage_09576.html,https://www.pref.wakayama.lg.jp/prefg/041200/d00203387_d/fil/20200217teisei.pdf,,1 ,,,,,,,,,,,Wakayama,Wakayama,Wakayama Prefecture,Female,135.167511,34.225965,2020/2/17,30,30,,,,,,,,,,,,
64 ,51 ,,A-42,,50 ,男性,2/17/2020,2/3/2020,和歌山県,和歌山県,,,和歌山県,和歌山県,,,,厚労省NO40の兄弟,https://www.mhlw.go.jp/stf/newpage_09576.html,https://www.pref.wakayama.lg.jp/prefg/041200/d00203387_d/fil/20200217teisei.pdf,,1 ,,,,,,,,,,,Wakayama,Wakayama,Wakayama Prefecture,Male,135.167511,34.225965,2020/2/17,30,30,,,,,,,,,,,,
65 ,52 ,,A-43,,50 ,男性,2/17/2020,2/7/2020,和歌山県,和歌山県,,,和歌山県,和歌山県,,,退院,,https://www.mhlw.go.jp/stf/newpage_09576.html,https://www.pref.wakayama.lg.jp/prefg/041200/d00203387_d/fil/20200217teisei.pdf,,1 ,,,,,,,,,,,Wakayama,Wakayama,Wakayama Prefecture,Male,135.167511,34.225965,2020/2/17,30,30,,,,,,,,,,,,
66 ,53 ,,A-44,,60 ,男性,2/17/2020,2/17/2020,愛知県,愛知県,,,愛知県,愛知県,6,,,尾張地方,https://www.mhlw.go.jp/stf/newpage_09576.html,https://www.pref.aichi.jp/uploaded/attachment/322088.pdf,,1 ,66 ,7 ,11 ,1 ,16 ,4 ,,,,,Aichi,Aichi,Aichi Prefecture,Male,136.906698,35.180246,2020/2/17,23,23,,,,,,,,,,,,
67 ,54 ,,A-45,,60 ,男性,2/18/2020,2/16/2020,和歌山県,和歌山県,,,和歌山県,和歌山県,,,退院,厚労省NO40と同室入院,https://www.mhlw.go.jp/stf/newpage_09609.html,https://www.pref.wakayama.lg.jp/prefg/041200/d00203387_d/fil/20200218press1.pdf,,1 ,,,,,,,,,,,Wakayama,Wakayama,Wakayama Prefecture,Male,135.167511,34.225965,2020/2/18,30,30,,,,,,,,,,,,
68 ,55 ,,A-46,,30 ,男性,2/18/2020,2/16/2020,和歌山県,和歌山県,,,和歌山県,和歌山県,,,,,https://www.mhlw.go.jp/stf/newpage_09609.html,https://www.pref.wakayama.lg.jp/prefg/041200/d00203387_d/fil/20200218press1.pdf,,1 ,,,,,,,,,DMAT,,Wakayama,Wakayama,Wakayama Prefecture,Male,135.167511,34.225965,2020/2/18,30,30,,,,,,,,,,,,
69 ,-,国内無症状,,,10 ,男性,2/18/2020,,和歌山県,和歌山県,,,和歌山県,和歌山県,,,退院,厚労省NO38の子,https://www.mhlw.go.jp/stf/newpage_09609.html,https://www.pref.wakayama.lg.jp/prefg/041200/d00203387_d/fil/20200218press1.pdf,,1 ,,,,,,,,,,,Wakayama,Wakayama,Wakayama Prefecture,Male,135.167511,34.225965,2020/2/18,30,30,,,,,,,,,,,,
70 ,56 ,,A-47,,80 ,男性,2/18/2020,2/9/2020,東京都,東京都,,,東京都,東京都,20,,死亡2例目,,https://www.mhlw.go.jp/stf/newpage_09609.html,https://www.bousai.metro.tokyo.lg.jp/taisaku/saigai/1007261/1007348.html,https://www.bousai.metro.tokyo.lg.jp/taisaku/saigai/1007261/1007380.html,1 ,,,,,,,,,無職,,Tokyo,Tokyo,Tokyo Metropolitan Government,Male,139.691647,35.689185,2020/2/18,13,13,,,,,,,,,,,,
71 ,57 ,,A-48,,20 ,男性,2/18/2020,2/7/2020,東京都,東京都,,,東京都,東京都,21,,退院または死亡,,https://www.mhlw.go.jp/stf/newpage_09609.html,https://www.bousai.metro.tokyo.lg.jp/taisaku/saigai/1007261/1007348.html,,1 ,,,,,,,,,会社員,,Tokyo,Tokyo,Tokyo Metropolitan Government,Male,139.691647,35.689185,2020/2/18,13,13,,,,,,,,,,,,
72 ,58 ,,A-49,,50 ,男性,2/18/2020,2/5/2020,東京都,東京都,,,東京都,東京都,22,,,,https://www.mhlw.go.jp/stf/newpage_09609.html,https://www.bousai.metro.tokyo.lg.jp/taisaku/saigai/1007261/1007348.html,,1 ,,,,,,,,,会社員,,Tokyo,Tokyo,Tokyo Metropolitan Government,Male,139.691647,35.689185,2020/2/18,13,13,,,,,,,,,,,,
73 ,59 ,,A-50,,60 ,男性,2/18/2020,2/17/2020,愛知県,愛知県,,,愛知県,愛知県,7,,,尾張地方,https://www.mhlw.go.jp/stf/newpage_09609.html,https://www.pref.aichi.jp/uploaded/attachment/322235.pdf,,1 ,,,,,,,,,,,Aichi,Aichi,Aichi Prefecture,Male,136.906698,35.180246,2020/2/18,23,23,,,,,,,,,,,,
74 ,62 ,,A-53,,60 ,男性,2/18/2020,2/3/2020,神奈川県,神奈川県,,横浜市,神奈川県横浜市,横浜市,6,1,退院,,https://www.mhlw.go.jp/stf/newpage_09643.html,https://www.pref.kanagawa.jp/docs/ga4/bukanshi/occurrence.html,https://www.pref.kanagawa.jp/docs/ga4/prs/prs_200218.html,1 ,,,,,,,,,タクシー運転手,,Kanagawa,Kanagawa,Yokohama City,Male,139.642153,35.444668,2020/2/18,14,14,,,,,,,,,,,,
75 ,63 ,,A-54,,40 ,男性,2/18/2020,2/8/2020,北海道,北海道,石狩振興局,札幌市,北海道札幌市,札幌市,3,,,,,http://www.pref.hokkaido.lg.jp/hf/kth/kak/hasseijoukyou.htm#2/18,https://www.city.sapporo.jp/hokenjo/f1kansen/2019n-covhassei.html#h0218,1 ,,,,,,,,,会社員,,Hokkaido,Hokkaido,Sapporo City,Male,141.341078,43.055282,2020/2/18,01,01,,,,,,,,,,,,
76 ,60 ,,A-51,,80 ,男性,2/18/2020,2/16/2020,神奈川県,神奈川県,,相模原市,神奈川県相模原市,相模原市,7,,死亡,,,https://www.pref.kanagawa.jp/docs/ga4/bukanshi/occurrence.html,https://www.city.sagamihara.kanagawa.jp/_res/projects/default_project/_page_/001/019/191/021902.pdf,1 ,76 ,10 ,14 ,1 ,16 ,0 ,,,,,Kanagawa,Kanagawa,Sagamihara City,Male,139.373234,35.571374,2020/2/18,14,14,,,,,,,,,,,,