{"text_format":"1","workbook":"xlsx","n_sheets":4,"sheets":["Master","Retail input","service input","service revenue"],"not_rendered":{"charts":0,"images":0,"macros":1,"external_links":1,"defined_names":63,"comments":0,"pivot_tables":0},"unopened":[],"bounds":{"document_bytes":16777216,"sheet_cells":100000,"rows_first":2000,"rows_last":500,"rows_between":2000,"halvings":0,"cell_chars":16384,"cell_head_chars":4096},"cells_cut":0,"cells_raw":0,"read":"whole","date_system":"1900"}

{"sheet":"Master","index":0,"n_rows":92,"n_cols":16,"rows_kept":92,"cut":false,"hidden":false,"merged":[[7,1,7,13],[8,3,8,13],[8,1,9,1],[8,2,9,2]]}
[]
[]
[]
[]
[]
[]
[]
[]
[null,"Date","Time","PARTICULARS"]
[null,null,null,"service","Description","Unit price","Qty",null,"Category","Box no","Category","Item name","Unit Price","Qty"]
[null,null,null,"choose_service","**","*",null,null,"Choose","Choose","*","*","*",null,null,200]
[null,"2013-12-27",null,"Pedicure","herbal",200,1,null,"Choose","Choose","*","*","*",null,null,90]
[null,"2013-12-27",null,"Threading","eyebrow",30,3,null,"Choose","Choose","*","*","*",null,null,175]
[null,"2013-12-27",null,"Waxing","full arms",175,1,null,"Choose","Choose","*","*","*",null,null,30]
[null,"2013-12-25",null,"Threading","eyebrow",30,1,null,"Choose","Choose","*","*","*"]
[null,"2013-12-25",null,"choose_service","**","*",null,null,"Choose","Choose","*","*","*",null,null,250]
[null,"2013-12-23",null,"bleach","niconi bleach",250,1,null,"Choose","Choose","*","*","*",null,null,1000]
[null,"2013-12-23",null,"facial","Shanaz",1000,1,null,"Choose","Choose","*","*","*",null,null,30]
[null,"2013-12-23",null,"Threading","eyebrow",30,1,null,"Choose","Choose","*","*","*",null,null,200]
[null,"2013-12-23",null,"Hair_colouring ","dye",200,1,null,"Choose","Choose","*","*","*",null,null,50]
[null,"2013-12-23",null,"hair_cut","stright cut",50,1,null,"Choose","Choose","*","*","*",null,null,50]
[null,"2013-12-20",null,"hair_cut","stright cut",50,1,null,"Choose","Choose","*","*","*",null,null,250]
[null,"2013-12-20",null,"facial","Gold (Fair & Glow) Facial",250,1,null,"Choose","Choose","*","*","*",null,null,100]
[null,"2013-12-20",null,"hair_cut","stright cut",50,2,null,"Choose","Choose","*","*","*",null,null,60]
[null,"2013-12-20",null,"Threading","eyebrow",30,2,null,"Choose","Choose","*","*","*",null,null,250]
[null,"2013-12-19",null,"bleach","niconi bleach",250,1,null,"Choose","Choose","*","*","*",null,null,60]
[null,"2013-12-19",null,"Threading","eyebrow",30,2,null,"Choose","Choose","*","*","*",null,null,30]
[null,"2013-12-16",null,"Threading","eyebrow",30,1,null,"Choose","Choose","*","*","*"]
[null,"2013-12-16",null,"choose_service","**","*",null,null,"Choose","Choose","*","*","*",null,null,50]
[null,"2013-12-16",null,"hair_cut","stright cut",50,1,null,"Choose","Choose","*","*","*"]
[null,"2013-12-16",null,"choose_service","**","*",null,null,"Choose","Choose","*","*","*",null,null,60]
[null,"2013-12-14",null,"Threading","eyebrow",30,2,null,"Choose","Choose","*","*","*",null,null,20]
[null,"2013-12-14",null,"Threading","upperlips, chin,forehead",20,1,null,"Choose","Choose","*","*","*",null,null,80]
[null,"2013-12-10",null,"hair_cut","u cut",80,1,null,"Choose","Choose","*","*","*",null,null,500]
[null,"2013-12-10",null,"Anti_dandruff ","Anti dandruff ",500,1,null,"Choose","Choose","*","*","*",null,null,200]
[null,"2013-12-10",null,"Waxing","full arms",200,1,null,"Choose","Choose","*","*","*",null,null,30]
[null,"2013-12-10",null,"Threading","eyebrow",30,1,null,"Choose","Choose","*","*","*",null,null,150]
[null,"2013-12-10",null,"Hair_colouring ","dye",150,1,null,"Choose","Choose","*","*","*",null,null,1500]
[null,"2013-12-10",null,"facial","Shanaz",750,2,null,"Choose","Choose","*","*","*",null,null,400]
[null,"2013-12-10",null,"bleach","niconi bleach",200,2,null,"Choose","Choose","*","*","*",null,null,200]
{"$rows_left_out":53}
{"sheet":"Retail input","index":1,"n_rows":750,"n_cols":34,"rows_kept":750,"cut":false,"hidden":false,"merged":[[4,22,4,24],[4,25,4,27],[4,28,4,30],[4,31,4,33],[5,4,6,4],[5,5,6,5],[5,6,6,6],[4,4,4,6],[4,7,4,9],[4,10,4,12],[4,13,4,15],[4,16,4,18],[4,19,4,21]]}
[]
[null,null,"Quick search"]
[null,null,null,{"$f":"VLOOKUP($C$3,$C$8:$G$750,2,FALSE)","v":0},{"$f":"VLOOKUP($C$3,$C$8:$G$750,3,FALSE)","v":0},{"$f":"VLOOKUP($C$3,$C$8:$G$750,4,FALSE)","v":0},{"$f":"VLOOKUP($C$3,$C$8:$G$750,5,FALSE)","v":0}]
[]
[null,null,null,null,"Inventory",null,null,"2013-10-01",null,null,"2014-03-01",null,null,"2015-02-01"]
[null,"Category","Box no","Item name","Total Purchased","Total Sold","Stock",{"$f":"H5","v":"2013-10-01"},{"$f":"H5","v":"2013-10-01"},{"$f":"H5","v":"2013-10-01"},{"$f":"K5","v":"2014-03-01"},{"$f":"K5","v":"2014-03-01"},{"$f":"K5","v":"2014-03-01"},{"$f":"N5","v":"2015-02-01"},{"$f":"N5","v":"2015-02-01"},{"$f":"N5","v":"2015-02-01"}]
[null,null,null,null,null,null,null,"Cost","MRP","Qty","Cost","MRP","Qty","Cost","MRP","Qty","Cost","MRP","Qty","Cost","MRP","Qty","Cost","MRP","Qty","Cost","MRP","Qty","Cost","MRP","Qty","Cost","MRP","Qty"]
[null,"Fancy",1,{"$error":"#N/A"},{"$f":"SUMIF($K$7:$BC$7,$M$7,K8:BC8)","v":0},null,{"$f":"E8-F8","v":0},null,5]
[null,"Fancy",2,{"$error":"#N/A"},{"$f":"SUMIF($K$7:$BC$7,$M$7,K9:BC9)","v":0},null,{"$f":"E9-F9","v":0}]
[null,"Fancy",3,{"$error":"#N/A"},0,null,0]
[null,"Fancy",4,{"$error":"#N/A"},0,null,0]
[null,"Fancy",5,"clip",2,null,2,null,40,null,null,40,2]
[null,"Fancy",6,"clip",6,null,6,null,25,null,null,25,6]
[null,"Fancy",7,"clip",1,null,1,null,25,null,null,25,1]
[null,"Fancy",9,"clip",3,null,3,null,25,null,null,25,3]
[null,"Fancy",13,"stone clip",2,null,2,null,80,null,null,80,2]
[null,"Fancy","13a","oval  clip",1,null,1,null,72,null,null,72,1]
[null,"Fancy","13b","catch clip",7,null,7,null,10,null,null,10,7]
[null,"Fancy","13c","kuchi clip",11,null,11,null,12,null,null,12,11]
[null,"Fancy","13d","nail polish",14,null,14,null,12,null,null,12,14]
[null,"Fancy",14,"clip",3,null,3,null,25,null,null,25,3]
[null,"Fancy",15,"box clip",1,null,1,null,100,null,null,100,1]
[null,"Fancy","17a","kutties clip",3,null,3,null,5,null,null,5,3]
[null,"Fancy","17b","kutties clip",3,null,3,null,10,null,null,10,3]
[null,"Fancy",18,"band stone",10,null,10,null,50,null,null,50,10]
[null,"Fancy",19,"kushi clip",2,null,2,null,12,null,null,12,2]
[null,"Fancy",20,"reeth",14,null,14,null,15,null,null,15,14]
[null,"Fancy",21,"reeth",9,null,9,null,16.5,null,null,16.5,9]
[null,"Fancy","21a","banana clip",8,null,8,null,20,null,null,20,8]
[null,"Fancy",22,"band",80,null,80,null,3,null,null,3,80]
[null,"Fancy",23,"reeth",7,null,7,null,35,null,null,35,7]
[null,"Fancy",28,"kushi clip small",109,null,109,null,3,null,null,3,109]
[null,"Fancy",29,"kushi clip big",134,null,134,null,5,null,null,5,134]
[null,"Fancy",30,"kammal",21,null,21,null,25,null,null,25,21]
[null,"Fancy",33,"kuchi clip",4,null,4,null,10,null,null,10,4]
[null,"Fancy",34,"block clip",3,null,3,null,8,null,null,8,3]
[null,"Fancy","36a","ceter clip",3,null,3,null,80,null,null,80,3]
[null,"Fancy","36b","center clip",4,null,4,null,75,null,null,75,4]
[null,"Fancy","36c","center clip",1,null,1,null,70,null,null,70,1]
[null,"Fancy",37,"stone clip",1,null,1,null,80,null,null,80,1]
{"$rows_left_out":711}
{"sheet":"service input","index":2,"n_rows":141,"n_cols":7,"rows_kept":141,"cut":false,"hidden":false,"merged":[[5,3,5,4]]}
[]
[]
[]
[]
[]
[null,null,null,"SERVICE",null,"2013-10-01"]
[null,null,null,"Category","Item name","MRP","MRP"]
[]
[null,"choose_service",null,"choose_service","**","*"]
[null,"Threading",null,"Threading","eyebrow",30]
[null,"Waxing",null,null,"upperlips, chin,forehead",20]
[null,"mehandi",null,null,"full face",100]
[null,"bleach"]
[null,"facial"]
[null,"Aroma_Facial",null,"Waxing","half arms",100]
[null,"Manicure",null,null,"full arms",200]
[null,"Pedicure",null,null,"half legs",100]
[null,"nail_filling_and_paint",null,null,"full legs",200]
[null,"hair_cut"]
[null,"hair_styling_Ironing_tongs",null,"Manicure","herbal",150]
[null,"Hair_wash_shampoo",null,null,"spa",250]
[null,"Hair_colouring "]
[null,"permanent_hair_straightning "]
[null,"hair_curling",null,"pedicure","herbal",200]
[null,"hair_spa",null,null,"spa",300]
[null,"Anti_dandruff "]
[null,"Anti_dandruff_with_serum"]
[null,"Anti_hair_fall",null,"nail_filling_and_paint","nail filling & paint",70]
[null,"Makeup"]
[null,"Others_Bride_Relatives_Friends"]
[null,"Bridal_packages"]
[null,null,null,"hair_cut","Baby cut",80]
[null,null,null,null,"pop cut",70]
[null,null,null,null,"stright cut",60]
[null,null,null,null,"u cut",80]
[null,null,null,null,"v cut",100]
[null,null,null,null,"step cut",200]
[null,null,null,null,"feather cut",250]
[null,null,null,null,"musroom cut",70]
[]
{"$rows_left_out":102}
{"sheet":"service revenue","index":3,"n_rows":136,"n_cols":13,"rows_kept":136,"cut":false,"hidden":false,"merged":[[4,0,6,0],[4,1,5,1],[4,2,5,2],[2,10,6,14],[8,10,8,11]]}
[]
[]
[null,null,null,null,null,null,null,null,null,null,"In cell D8, compare the value of C8 with 'sheet master E12:E100,value of E5 with 'sheet master B12:B100 , then multiply and sum 'sheet master( F12:F100, G12:G100)"]
[]
["Total","Service","Category",null,"2013-10-01",null,null,"2013-11-01"]
[null,null,null,"Actual ₹","Plan ₹","Qty"]
[]
[1,"Threading","eyebrow",{"$f":"SUM(INDEX((Master!E12:E100='service revenue'!C8)*(Master!B12:B100-DAY(Master!B12:B100)='service revenue'!E5-DAY('service revenue'!E5))*Master!F12:F100*Master!G12:G100,))","v":{"$error":"#VALUE!"}},{"$f":"(INDEX('service input'!$F$10:$N$141,MATCH($C8,'service input'!$E$10:$E$140,0),MATCH(E$5-DAY(E$5)+1,referencemonth,1)+MATCH(\"MRP\",'service input'!$F$7:$N$7,0)-1))*F8","v":60},{"$f":"SUMIFS(Master!$G$12:$G$4000,Master!$E$12:$E$4000,C8,Master!$B$12:$B$4000,\">=\"&E$5,Master!$B$12:$B$4000,\"<=\"&EOMONTH(E$5,0))","v":2}]
[0,null,"upperlips, chin,forehead",null,{"$f":"(INDEX('service input'!$F$10:$N$141,MATCH($C9,'service input'!$E$10:$E$140,0),MATCH(E$5-DAY(E$5)+1,referencemonth,1)+MATCH(\"MRP\",'service input'!$F$7:$N$7,0)-1))*F9","v":0},{"$f":"SUMIFS(Master!$G$12:$G$4000,Master!$E$12:$E$4000,C9,Master!$B$12:$B$4000,\">=\"&E$5,Master!$B$12:$B$4000,\"<=\"&EOMONTH(E$5,0))","v":0},null,null,null,null,"at d8  required value",null,60]
[0,null,"full face",null,{"$f":"(INDEX('service input'!$F$10:$N$141,MATCH($C10,'service input'!$E$10:$E$140,0),MATCH(E$5-DAY(E$5)+1,referencemonth,1)+MATCH(\"MRP\",'service input'!$F$7:$N$7,0)-1))*F10","v":0},{"$f":"SUMIFS(Master!$G$12:$G$4000,Master!$E$12:$E$4000,C10,Master!$B$12:$B$4000,\">=\"&E$5,Master!$B$12:$B$4000,\"<=\"&EOMONTH(E$5,0))","v":0}]
[0,null,0,null,{"$f":"(INDEX('service input'!$F$10:$N$141,MATCH($C11,'service input'!$E$10:$E$140,0),MATCH(E$5-DAY(E$5)+1,referencemonth,1)+MATCH(\"MRP\",'service input'!$F$7:$N$7,0)-1))*F11","v":{"$error":"#N/A"}},{"$f":"SUMIFS(Master!$G$12:$G$4000,Master!$E$12:$E$4000,C11,Master!$B$12:$B$4000,\">=\"&E$5,Master!$B$12:$B$4000,\"<=\"&EOMONTH(E$5,0))","v":0}]
[0,null,0,null,{"$f":"(INDEX('service input'!$F$10:$N$141,MATCH($C12,'service input'!$E$10:$E$140,0),MATCH(E$5-DAY(E$5)+1,referencemonth,1)+MATCH(\"MRP\",'service input'!$F$7:$N$7,0)-1))*F12","v":{"$error":"#N/A"}},{"$f":"SUMIFS(Master!$G$12:$G$4000,Master!$E$12:$E$4000,C12,Master!$B$12:$B$4000,\">=\"&E$5,Master!$B$12:$B$4000,\"<=\"&EOMONTH(E$5,0))","v":0}]
[0,"Waxing","half arms",null,{"$f":"(INDEX('service input'!$F$10:$N$141,MATCH($C13,'service input'!$E$10:$E$140,0),MATCH(E$5-DAY(E$5)+1,referencemonth,1)+MATCH(\"MRP\",'service input'!$F$7:$N$7,0)-1))*F13","v":0},{"$f":"SUMIFS(Master!$G$12:$G$4000,Master!$E$12:$E$4000,C13,Master!$B$12:$B$4000,\">=\"&E$5,Master!$B$12:$B$4000,\"<=\"&EOMONTH(E$5,0))","v":0}]
[0,null,"full arms",null,{"$f":"(INDEX('service input'!$F$10:$N$141,MATCH($C14,'service input'!$E$10:$E$140,0),MATCH(E$5-DAY(E$5)+1,referencemonth,1)+MATCH(\"MRP\",'service input'!$F$7:$N$7,0)-1))*F14","v":0},{"$f":"SUMIFS(Master!$G$12:$G$4000,Master!$E$12:$E$4000,C14,Master!$B$12:$B$4000,\">=\"&E$5,Master!$B$12:$B$4000,\"<=\"&EOMONTH(E$5,0))","v":0}]
[0,null,"half legs",null,{"$f":"(INDEX('service input'!$F$10:$N$141,MATCH($C15,'service input'!$E$10:$E$140,0),MATCH(E$5-DAY(E$5)+1,referencemonth,1)+MATCH(\"MRP\",'service input'!$F$7:$N$7,0)-1))*F15","v":0},{"$f":"SUMIFS(Master!$G$12:$G$4000,Master!$E$12:$E$4000,C15,Master!$B$12:$B$4000,\">=\"&E$5,Master!$B$12:$B$4000,\"<=\"&EOMONTH(E$5,0))","v":0}]
[0,null,"full legs",null,{"$f":"(INDEX('service input'!$F$10:$N$141,MATCH($C16,'service input'!$E$10:$E$140,0),MATCH(E$5-DAY(E$5)+1,referencemonth,1)+MATCH(\"MRP\",'service input'!$F$7:$N$7,0)-1))*F16","v":0},{"$f":"SUMIFS(Master!$G$12:$G$4000,Master!$E$12:$E$4000,C16,Master!$B$12:$B$4000,\">=\"&E$5,Master!$B$12:$B$4000,\"<=\"&EOMONTH(E$5,0))","v":0}]
[0,null,0,null,{"$f":"(INDEX('service input'!$F$10:$N$141,MATCH($C17,'service input'!$E$10:$E$140,0),MATCH(E$5-DAY(E$5)+1,referencemonth,1)+MATCH(\"MRP\",'service input'!$F$7:$N$7,0)-1))*F17","v":{"$error":"#N/A"}},{"$f":"SUMIFS(Master!$G$12:$G$4000,Master!$E$12:$E$4000,C17,Master!$B$12:$B$4000,\">=\"&E$5,Master!$B$12:$B$4000,\"<=\"&EOMONTH(E$5,0))","v":0}]
[0,"Manicure","herbal",null,{"$f":"(INDEX('service input'!$F$10:$N$141,MATCH($C18,'service input'!$E$10:$E$140,0),MATCH(E$5-DAY(E$5)+1,referencemonth,1)+MATCH(\"MRP\",'service input'!$F$7:$N$7,0)-1))*F18","v":0},{"$f":"SUMIFS(Master!$G$12:$G$4000,Master!$E$12:$E$4000,C18,Master!$B$12:$B$4000,\">=\"&E$5,Master!$B$12:$B$4000,\"<=\"&EOMONTH(E$5,0))","v":0}]
[0,null,"spa",null,{"$f":"(INDEX('service input'!$F$10:$N$141,MATCH($C19,'service input'!$E$10:$E$140,0),MATCH(E$5-DAY(E$5)+1,referencemonth,1)+MATCH(\"MRP\",'service input'!$F$7:$N$7,0)-1))*F19","v":0},{"$f":"SUMIFS(Master!$G$12:$G$4000,Master!$E$12:$E$4000,C19,Master!$B$12:$B$4000,\">=\"&E$5,Master!$B$12:$B$4000,\"<=\"&EOMONTH(E$5,0))","v":0}]
[0,null,0,null,{"$f":"(INDEX('service input'!$F$10:$N$141,MATCH($C20,'service input'!$E$10:$E$140,0),MATCH(E$5-DAY(E$5)+1,referencemonth,1)+MATCH(\"MRP\",'service input'!$F$7:$N$7,0)-1))*F20","v":{"$error":"#N/A"}},{"$f":"SUMIFS(Master!$G$12:$G$4000,Master!$E$12:$E$4000,C20,Master!$B$12:$B$4000,\">=\"&E$5,Master!$B$12:$B$4000,\"<=\"&EOMONTH(E$5,0))","v":0}]
[0,null,0,null,{"$f":"(INDEX('service input'!$F$10:$N$141,MATCH($C21,'service input'!$E$10:$E$140,0),MATCH(E$5-DAY(E$5)+1,referencemonth,1)+MATCH(\"MRP\",'service input'!$F$7:$N$7,0)-1))*F21","v":{"$error":"#N/A"}},{"$f":"SUMIFS(Master!$G$12:$G$4000,Master!$E$12:$E$4000,C21,Master!$B$12:$B$4000,\">=\"&E$5,Master!$B$12:$B$4000,\"<=\"&EOMONTH(E$5,0))","v":0}]
[0,"pedicure","herbal",null,{"$f":"(INDEX('service input'!$F$10:$N$141,MATCH($C22,'service input'!$E$10:$E$140,0),MATCH(E$5-DAY(E$5)+1,referencemonth,1)+MATCH(\"MRP\",'service input'!$F$7:$N$7,0)-1))*F22","v":0},{"$f":"SUMIFS(Master!$G$12:$G$4000,Master!$E$12:$E$4000,C22,Master!$B$12:$B$4000,\">=\"&E$5,Master!$B$12:$B$4000,\"<=\"&EOMONTH(E$5,0))","v":0}]
[0,null,"spa",null,{"$f":"(INDEX('service input'!$F$10:$N$141,MATCH($C23,'service input'!$E$10:$E$140,0),MATCH(E$5-DAY(E$5)+1,referencemonth,1)+MATCH(\"MRP\",'service input'!$F$7:$N$7,0)-1))*F23","v":0},{"$f":"SUMIFS(Master!$G$12:$G$4000,Master!$E$12:$E$4000,C23,Master!$B$12:$B$4000,\">=\"&E$5,Master!$B$12:$B$4000,\"<=\"&EOMONTH(E$5,0))","v":0}]
[0,null,0,null,{"$f":"(INDEX('service input'!$F$10:$N$141,MATCH($C24,'service input'!$E$10:$E$140,0),MATCH(E$5-DAY(E$5)+1,referencemonth,1)+MATCH(\"MRP\",'service input'!$F$7:$N$7,0)-1))*F24","v":{"$error":"#N/A"}},{"$f":"SUMIFS(Master!$G$12:$G$4000,Master!$E$12:$E$4000,C24,Master!$B$12:$B$4000,\">=\"&E$5,Master!$B$12:$B$4000,\"<=\"&EOMONTH(E$5,0))","v":0}]
[0,null,0,null,{"$f":"(INDEX('service input'!$F$10:$N$141,MATCH($C25,'service input'!$E$10:$E$140,0),MATCH(E$5-DAY(E$5)+1,referencemonth,1)+MATCH(\"MRP\",'service input'!$F$7:$N$7,0)-1))*F25","v":{"$error":"#N/A"}},{"$f":"SUMIFS(Master!$G$12:$G$4000,Master!$E$12:$E$4000,C25,Master!$B$12:$B$4000,\">=\"&E$5,Master!$B$12:$B$4000,\"<=\"&EOMONTH(E$5,0))","v":0}]
[0,"nail_filling_and_paint","nail filling & paint",null,{"$f":"(INDEX('service input'!$F$10:$N$141,MATCH($C26,'service input'!$E$10:$E$140,0),MATCH(E$5-DAY(E$5)+1,referencemonth,1)+MATCH(\"MRP\",'service input'!$F$7:$N$7,0)-1))*F26","v":0},{"$f":"SUMIFS(Master!$G$12:$G$4000,Master!$E$12:$E$4000,C26,Master!$B$12:$B$4000,\">=\"&E$5,Master!$B$12:$B$4000,\"<=\"&EOMONTH(E$5,0))","v":0}]
[0,null,0,null,{"$f":"(INDEX('service input'!$F$10:$N$141,MATCH($C27,'service input'!$E$10:$E$140,0),MATCH(E$5-DAY(E$5)+1,referencemonth,1)+MATCH(\"MRP\",'service input'!$F$7:$N$7,0)-1))*F27","v":{"$error":"#N/A"}},{"$f":"SUMIFS(Master!$G$12:$G$4000,Master!$E$12:$E$4000,C27,Master!$B$12:$B$4000,\">=\"&E$5,Master!$B$12:$B$4000,\"<=\"&EOMONTH(E$5,0))","v":0}]
[0,null,0,null,{"$f":"(INDEX('service input'!$F$10:$N$141,MATCH($C28,'service input'!$E$10:$E$140,0),MATCH(E$5-DAY(E$5)+1,referencemonth,1)+MATCH(\"MRP\",'service input'!$F$7:$N$7,0)-1))*F28","v":{"$error":"#N/A"}},{"$f":"SUMIFS(Master!$G$12:$G$4000,Master!$E$12:$E$4000,C28,Master!$B$12:$B$4000,\">=\"&E$5,Master!$B$12:$B$4000,\"<=\"&EOMONTH(E$5,0))","v":0}]
[0,null,0,null,{"$f":"(INDEX('service input'!$F$10:$N$141,MATCH($C29,'service input'!$E$10:$E$140,0),MATCH(E$5-DAY(E$5)+1,referencemonth,1)+MATCH(\"MRP\",'service input'!$F$7:$N$7,0)-1))*F29","v":{"$error":"#N/A"}},{"$f":"SUMIFS(Master!$G$12:$G$4000,Master!$E$12:$E$4000,C29,Master!$B$12:$B$4000,\">=\"&E$5,Master!$B$12:$B$4000,\"<=\"&EOMONTH(E$5,0))","v":0}]
[0,"hair_cut","Baby cut",null,{"$f":"(INDEX('service input'!$F$10:$N$141,MATCH($C30,'service input'!$E$10:$E$140,0),MATCH(E$5-DAY(E$5)+1,referencemonth,1)+MATCH(\"MRP\",'service input'!$F$7:$N$7,0)-1))*F30","v":0},{"$f":"SUMIFS(Master!$G$12:$G$4000,Master!$E$12:$E$4000,C30,Master!$B$12:$B$4000,\">=\"&E$5,Master!$B$12:$B$4000,\"<=\"&EOMONTH(E$5,0))","v":0}]
[0,null,"pop cut",null,{"$f":"(INDEX('service input'!$F$10:$N$141,MATCH($C31,'service input'!$E$10:$E$140,0),MATCH(E$5-DAY(E$5)+1,referencemonth,1)+MATCH(\"MRP\",'service input'!$F$7:$N$7,0)-1))*F31","v":0},{"$f":"SUMIFS(Master!$G$12:$G$4000,Master!$E$12:$E$4000,C31,Master!$B$12:$B$4000,\">=\"&E$5,Master!$B$12:$B$4000,\"<=\"&EOMONTH(E$5,0))","v":0}]
[0,null,"stright cut",null,{"$f":"(INDEX('service input'!$F$10:$N$141,MATCH($C32,'service input'!$E$10:$E$140,0),MATCH(E$5-DAY(E$5)+1,referencemonth,1)+MATCH(\"MRP\",'service input'!$F$7:$N$7,0)-1))*F32","v":0},{"$f":"SUMIFS(Master!$G$12:$G$4000,Master!$E$12:$E$4000,C32,Master!$B$12:$B$4000,\">=\"&E$5,Master!$B$12:$B$4000,\"<=\"&EOMONTH(E$5,0))","v":0}]
[0,null,"u cut",null,{"$f":"(INDEX('service input'!$F$10:$N$141,MATCH($C33,'service input'!$E$10:$E$140,0),MATCH(E$5-DAY(E$5)+1,referencemonth,1)+MATCH(\"MRP\",'service input'!$F$7:$N$7,0)-1))*F33","v":0},{"$f":"SUMIFS(Master!$G$12:$G$4000,Master!$E$12:$E$4000,C33,Master!$B$12:$B$4000,\">=\"&E$5,Master!$B$12:$B$4000,\"<=\"&EOMONTH(E$5,0))","v":0}]
[0,null,"v cut",null,{"$f":"(INDEX('service input'!$F$10:$N$141,MATCH($C34,'service input'!$E$10:$E$140,0),MATCH(E$5-DAY(E$5)+1,referencemonth,1)+MATCH(\"MRP\",'service input'!$F$7:$N$7,0)-1))*F34","v":0},{"$f":"SUMIFS(Master!$G$12:$G$4000,Master!$E$12:$E$4000,C34,Master!$B$12:$B$4000,\">=\"&E$5,Master!$B$12:$B$4000,\"<=\"&EOMONTH(E$5,0))","v":0}]
[0,null,"step cut",null,{"$f":"(INDEX('service input'!$F$10:$N$141,MATCH($C35,'service input'!$E$10:$E$140,0),MATCH(E$5-DAY(E$5)+1,referencemonth,1)+MATCH(\"MRP\",'service input'!$F$7:$N$7,0)-1))*F35","v":0},{"$f":"SUMIFS(Master!$G$12:$G$4000,Master!$E$12:$E$4000,C35,Master!$B$12:$B$4000,\">=\"&E$5,Master!$B$12:$B$4000,\"<=\"&EOMONTH(E$5,0))","v":0}]
[0,null,"feather cut",null,{"$f":"(INDEX('service input'!$F$10:$N$141,MATCH($C36,'service input'!$E$10:$E$140,0),MATCH(E$5-DAY(E$5)+1,referencemonth,1)+MATCH(\"MRP\",'service input'!$F$7:$N$7,0)-1))*F36","v":0},{"$f":"SUMIFS(Master!$G$12:$G$4000,Master!$E$12:$E$4000,C36,Master!$B$12:$B$4000,\">=\"&E$5,Master!$B$12:$B$4000,\"<=\"&EOMONTH(E$5,0))","v":0}]
[0,null,"musroom cut",null,{"$f":"(INDEX('service input'!$F$10:$N$141,MATCH($C37,'service input'!$E$10:$E$140,0),MATCH(E$5-DAY(E$5)+1,referencemonth,1)+MATCH(\"MRP\",'service input'!$F$7:$N$7,0)-1))*F37","v":0},{"$f":"SUMIFS(Master!$G$12:$G$4000,Master!$E$12:$E$4000,C37,Master!$B$12:$B$4000,\">=\"&E$5,Master!$B$12:$B$4000,\"<=\"&EOMONTH(E$5,0))","v":0}]
[0,null,0,null,{"$f":"(INDEX('service input'!$F$10:$N$141,MATCH($C38,'service input'!$E$10:$E$140,0),MATCH(E$5-DAY(E$5)+1,referencemonth,1)+MATCH(\"MRP\",'service input'!$F$7:$N$7,0)-1))*F38","v":{"$error":"#N/A"}},{"$f":"SUMIFS(Master!$G$12:$G$4000,Master!$E$12:$E$4000,C38,Master!$B$12:$B$4000,\">=\"&E$5,Master!$B$12:$B$4000,\"<=\"&EOMONTH(E$5,0))","v":0}]
[0,"hair_styling_Ironing_tongs","temporary ironing ",null,{"$f":"(INDEX('service input'!$F$10:$N$141,MATCH($C39,'service input'!$E$10:$E$140,0),MATCH(E$5-DAY(E$5)+1,referencemonth,1)+MATCH(\"MRP\",'service input'!$F$7:$N$7,0)-1))*F39","v":{"$error":"#VALUE!"}},{"$f":"SUMIFS(Master!$G$12:$G$4000,Master!$E$12:$E$4000,C39,Master!$B$12:$B$4000,\">=\"&E$5,Master!$B$12:$B$4000,\"<=\"&EOMONTH(E$5,0))","v":0}]
[0,null,0,null,{"$f":"(INDEX('service input'!$F$10:$N$141,MATCH($C40,'service input'!$E$10:$E$140,0),MATCH(E$5-DAY(E$5)+1,referencemonth,1)+MATCH(\"MRP\",'service input'!$F$7:$N$7,0)-1))*F40","v":{"$error":"#N/A"}},{"$f":"SUMIFS(Master!$G$12:$G$4000,Master!$E$12:$E$4000,C40,Master!$B$12:$B$4000,\">=\"&E$5,Master!$B$12:$B$4000,\"<=\"&EOMONTH(E$5,0))","v":0}]
{"$rows_left_out":96}